{"text_format":"3","workbook":"xlsx","n_sheets":7,"sheets":["AppLists","APP","db_header","db_details_Q1","db_details_Q2","db_details_Q3","db_details_Q4"],"not_rendered":{"macros":1,"defined_names":5},"read":"whole","date_system":"1900"}

{"sheet":"AppLists","index":0,"n_rows":4044,"n_cols":18,"rows_kept":4044}
["CATEGORY","Agency Name","Agency Account Code",null,"Organization Type",null,"REGIONS",null,"Depot/SubDepot","Rate",1,null,"ITEM","Segment","Price",null,"Agency Account Code","Agency Name"]
[null,"OFFICE OF THE PRESIDENT","A001",null,"National Government Agency (NGA)",null,"Camiguin",null,"MAIN & NCR",1.04,0.04,null,"43202222-CA-001",11,6045.76,null,"A001","OFFICE OF THE PRESIDENT"]
[null,"NATIONAL POLICE COMMISSION - MAIN","A002",null,"Elementary and Secondary School",null,"CAR",null,"CAR - Baguio",1.06,0.06,null,"13111203-AC-F01",11,708.88,null,"A002","NATIONAL POLICE COMMISSION - MAIN"]
[null,"NATIONAL AMNESTY COMMISSION","A003",null,"Government Owned and Controlled Corporation (GOCC)",null,"MAIN & NCR",null,"CAR - Bontoc",1.07,0.07,null,"47131812-AF-A01",11,82.75,null,"A003","NATIONAL AMNESTY COMMISSION"]
[null,"NATIONAL PROGRAM FOR UNIFICATION AND DEV'T COUNCIL","A004",null,"State University and College (SUC)",null,"MndanaoHubDavao",null,"Surigao Del Norte",1.13,0.13,null,"43212111-GFA001",11,{"v":0,"d":"0.00"},null,"A004","NATIONAL PROGRAM FOR UNIFICATION AND DEV'T COUNCIL"]
[null,"OFFICE OF NORTHERN CULTURAL COMMUNITIES","A005",null,"Local Government Unit (LGU)",null,"Region I",null,"I - La Union",1.06,0.06,null,"48101714-AP-D01",11,{"v":1200,"d":"1200.00"},null,"A005","OFFICE OF NORTHERN CULTURAL COMMUNITIES"]
[null,"OFFICE OF SOUTHERN CULTURAL COMMUNITIES","A006",null,"Local Water Utilities Administration",null,"Region II",null,"II - Tuguegarao",1.07,0.07,null,"12191601-AL-E01",11,{"v":42.3,"d":"42.30"},null,"A006","OFFICE OF SOUTHERN CULTURAL COMMUNITIES"]
[null,"OFFICE OF THE PRES'L ADVISER ON THE PEACE PROCESS","A007",{"$nulls":3},"Region III",null,"III - Pampanga",1.05,0.05,null,"39111801-BA-F01",11,{"v":69.9,"d":"69.90"},null,"A007","OFFICE OF THE PRES'L ADVISER ON THE PEACE PROCESS"]
[null,"PRESIDENTIAL ANTI-CRIME COMMISSION","A008",{"$nulls":3},"Region IV",null,"IVB - Palawan",1.09,0.09,null,"39111801-BA-F02",11,{"v":0,"d":"0.00"},null,"A008","PRESIDENTIAL ANTI-CRIME COMMISSION"]
[null,"PRESIDENTIAL COMMISSION ON GOOD GOVERNMENT","A010",{"$nulls":3},"Region IX Sibugay",null,"IX - Zamboanga City",1.09,0.09,null,"26111702-BT-A02",11,18.75,null,"A010","PRESIDENTIAL COMMISSION ON GOOD GOVERNMENT"]
[null,"PRESIDENTIAL COMMISSION ON RE-ORGANIZATION","A011",{"$nulls":3},"Region V",null,"IX - Zamboanga Sibugay",1.11,0.11,null,"26111702-BT-A01",11,18.97,null,"A011","PRESIDENTIAL COMMISSION ON RE-ORGANIZATION"]
[null,"PRES'L COMMISSION ON THE PHIL. NUCLEAR POWER PLANT","A012",{"$nulls":3},"Region VI",null,"V - Legazpi",1.08,0.08,null,"26111702-BT-A03",11,{"v":85,"d":"85.00"},null,"A012","PRES'L COMMISSION ON THE PHIL. NUCLEAR POWER PLANT"]
[null,"PRES'L COMMITTEE ON FLAGSHIP PROGRAMS & PROJECTS","A013",{"$nulls":3},"Region VIII",null,"VI - Bacolod",1.12,0.12,null,"44122003-BI-D01",11,{"v":110,"d":"110.00"},null,"A013","PRES'L COMMITTEE ON FLAGSHIP PROGRAMS & PROJECTS"]
[null,"PRESIDENTIAL COMMISSION FOR THE URBAN POOR - MAIN","A014",{"$nulls":3},"Region VIII Biliran",null,"VII - Cebu",1.1,0.1,null,"44122003-BI-D02",11,{"v":115,"d":"115.00"},null,"A014","PRESIDENTIAL COMMISSION FOR THE URBAN POOR - MAIN"]
[null,"PRESIDENTIAL COUNCIL FOR YOUTH AFFAIRS","A015",{"$nulls":3},"Region VIII Borongan",null,"VIII - Biliran",1.13,0.13,null,"44101602-PB-M01",11,{"v":10000,"d":"10000.00"},null,"A015","PRESIDENTIAL COUNCIL FOR YOUTH AFFAIRS"]
[null,"PRESIDENTIAL SECURITY GROUP","A016",{"$nulls":3},"Region VIII Samar",null,"VIII - Borongan",1.13,0.13,null,"47131604-BR-S01",11,{"v":125,"d":"125.00"},null,"A016","PRESIDENTIAL SECURITY GROUP"]
[null,"PRES'L T.FORCE ON REHAB OF E.QUAKE AFFECTED AREAS","A017",{"$nulls":3},"Region X",null,"VIII - Calbayog",1.12,0.12,null,"47131604-BR-T01",11,{"v":29.4,"d":"29.40"},null,"A017","PRES'L T.FORCE ON REHAB OF E.QUAKE AFFECTED AREAS"]
[null,"PROJECT FACILITATION COMMITTEE","A018",{"$nulls":3},"Region XI",null,"VIII - Catarman",1.11,0.11,null,"44101807-CA-C01",11,{"v":130,"d":"130.00"},null,"A018","PROJECT FACILITATION COMMITTEE"]
[null,"NATIONAL ANTI-POVERTY COMMISSION","A019",{"$nulls":3},"Region XII Koronadal",null,"VIII - Maasin",1.16,0.16,null,"44101810-CA-D02",11,{"v":0,"d":"0.00"},null,"A019","NATIONAL ANTI-POVERTY COMMISSION"]
[null,"SPECIAL OPERATION TEAM","A020",{"$nulls":3},"Region XIII",null,"VIII - Tacloban",1.12,0.12,null,"44101810-CA-D01",11,{"v":895,"d":"895.00"},null,"A020","SPECIAL OPERATION TEAM"]
[null,"STATISTICAL RESEARCH AND TRAINING CENTER","A021",{"$nulls":3},"Regions IX & XII",null,"X - Bukidnon",1.11,0.11,null,"44101808-CA-S01",11,248.88,null,"A021","STATISTICAL RESEARCH AND TRAINING CENTER"]
[null,"TASK FORCE ANTI-GAMBLING","A022",{"$nulls":3},"Regions VII",null,"X - Cagayan De Oro",1.08,0.08,null,"13111201-CF-P01",11,{"v":212.5,"d":"212.50"},null,"A022","TASK FORCE ANTI-GAMBLING"]
[null,"PRES'L INTER-AGENCY COMM ON INT'GENCE PROP.RIGHTS","A023",{"$nulls":3},"RegIX Zamboanga",null,"X - Camiguin",1.15,0.15,null,"13111201-CF-P02",11,{"v":200.5,"d":"200.50"},null,"A023","PRES'L INTER-AGENCY COMM ON INT'GENCE PROP.RIGHTS"]
[null,"NATIONAL COUNCIL FOR INTEGRATED AREA DEVELOPMENT","A024",{"$nulls":3},"RegVIII Calbayog",null,"X - Misamis Occidental",1.09,0.09,null,"14111525-CA-A01",11,69.98,null,"A024","NATIONAL COUNCIL FOR INTEGRATED AREA DEVELOPMENT"]
[null,"PALAWAN COUNCIL FOR SUSTAINABLE DEVELOPMENT STAFF","A025",{"$nulls":3},"RegVIII Maasin",null,"X - Misamis Oriental",1.12,0.12,null,"14111525-CA-W01",11,{"v":50,"d":"50.00"},null,"A025","PALAWAN COUNCIL FOR SUSTAINABLE DEVELOPMENT STAFF"]
[null,"TECH'L EDUC'N SKILLS DEV'T AUTHORITY-MAIN","A026",{"$nulls":3},"RegVIII NSCatarman",null,"XI - Davao",1.09,0.09,null,"46101600-CRT-09",11,{"v":21,"d":"21.00"},null,"A026","TECH'L EDUC'N SKILLS DEV'T AUTHORITY-MAIN"]
[null,"TESDA-APPAREL TEXTILE (NMYC)","A027",{"$nulls":3},"RegX NM Camiguin",null,"XII - Koronadal",1.1,0.1,null,"56101504-CM-B01",11,{"v":252.5,"d":"252.50"},null,"A027","TESDA-APPAREL TEXTILE (NMYC)"]
[null,"TECH'L & EDUC'L SKILLS DEV'T AUTHORITY/NMYC-CAR","A028",{"$nulls":3},"RegX NMBukidnon",null,"XIII - Butuan",1.09,0.09,null,"56101504-CM-W01",11,{"v":252.5,"d":"252.50"},null,"A028","TECH'L & EDUC'L SKILLS DEV'T AUTHORITY/NMYC-CAR"]
[null,"FOOTWEAR & LEATHERGOODS INDUSTRY CENTER(NMYC)","A029",{"$nulls":3},"RegXIII Butuan",{"$nulls":5},"44121710-CH-W01",11,24.69,null,"A029","FOOTWEAR & LEATHERGOODS INDUSTRY CENTER(NMYC)"]
[null,"TECHNICAL EDUCATION & SKILLS DEV'T AUTHORITY - NCR","A030",{"$nulls":3},"RegXIII Caraga",{"$nulls":5},"47131829-TB-C01",11,{"v":40,"d":"40.00"},null,"A030","TECHNICAL EDUCATION & SKILLS DEV'T AUTHORITY - NCR"]
[null,"NAT'L INST. OF TECH'L VOC'L,EDUC'L & TRNG(OMSD)","A031",{"$nulls":3},"RegXNM Misamis Or",{"$nulls":5},"47131805-CL-P01",11,{"v":23,"d":"23.00"},null,"A031","NAT'L INST. OF TECH'L VOC'L,EDUC'L & TRNG(OMSD)"]
[null,"TECH'L EDUC'N SKILLS DEV'T AUTHORITY-REG. I","A032",{"$nulls":3},"RegXNMMisamis Occ",{"$nulls":5},"60121413-CB-P01",11,38.25,null,"A032","TECH'L EDUC'N SKILLS DEV'T AUTHORITY-REG. I"]
[null,"TECH & EDUC'L SKILLS DEV'T AUTHORITY-REG.III","A033",{"$nulls":3},"SURIGAO DEL NORTE",{"$nulls":5},"60121413-CB-P02",11,40.75,null,"A033","TECH & EDUC'L SKILLS DEV'T AUTHORITY-REG.III"]
[null,"TESDA/NMYC-REG'L MANPOWER TRAINING CENTER","A034",{"$nulls":9},"44122105-BF-C01",11,7.28,null,"A034","TESDA/NMYC-REG'L MANPOWER TRAINING CENTER"]
[null,"TESDA - REGION IV-A","A035",{"$nulls":9},"44122105-BF-C02",11,12.88,null,"A035","TESDA - REGION IV-A"]
[null,"COOPERATIVE DEV'T AUTHORITY-MANILA EXTN. OFFICE","A036",{"$nulls":5},"43211507-DCT-03",12,null,null,"44122105-BF-C03",11,19.76,null,"A036","COOPERATIVE DEV'T AUTHORITY-MANILA EXTN. OFFICE"]
[null,"BOARD OF LIQUIDATORS","A037",{"$nulls":5},"43211503-LCT-02",12,null,null,"44122105-BF-C04",11,{"v":38,"d":"38.00"},null,"A037","BOARD OF LIQUIDATORS"]
[null,"COOPERATIVE DEVELOPMENT AUTHORITY -CENTRAL OFFICE","A038",{"$nulls":5},"43211503-LCT-01",12,null,null,"44122105-BD-C01",11,{"v":0,"d":"0.00"},null,"A038","COOPERATIVE DEVELOPMENT AUTHORITY -CENTRAL OFFICE"]
[null,"COOPERATIVE DEV'T AUTHORITY - MANILA EXTN OFFICE","A039",{"$nulls":5},"43211507-DCT-02",12,null,null,"14111513-CO-N01",11,{"v":21,"d":"21.00"},null,"A039","COOPERATIVE DEV'T AUTHORITY - MANILA EXTN OFFICE"]
[null,"COOPERATIVE DEV'T AUTHORITY - CALAMBA EXTN OFFICE","A040",{"$nulls":5},"43212102-PR-D02",12,null,null,"14111513-CO-P02",11,{"v":35,"d":"35.00"},null,"A040","COOPERATIVE DEV'T AUTHORITY - CALAMBA EXTN OFFICE"]
[null,"ECONOMIC SUPPORT FUND-SECRETARIAT","A041",{"$nulls":5},"43211507-DCT-01",12,null,null,"14111513-CO-P03",11,34.48,null,"A041","ECONOMIC SUPPORT FUND-SECRETARIAT"]
[null,"MANAGEMENT COORDINATING BOARD","A042",{"$nulls":5},"45121517-DO-C01",12,null,null,"14111513-CO-P04",11,{"v":0,"d":"0.00"},null,"A042","MANAGEMENT COORDINATING BOARD"]
[null,"ZAMBOANGA ECONOMIC ZONE & FREEPORT AUTHORITY","A043",{"$nulls":5},"45111609-MM-P01",12,null,null,"43202001-CD-R01",11,9.75,null,"A043","ZAMBOANGA ECONOMIC ZONE & FREEPORT AUTHORITY"]
[null,"NATIONAL COMMISSION FOR CULTURE AND THE ARTS","A044",{"$nulls":9},"43202001-CD-W01",11,16.75,null,"A044","NATIONAL COMMISSION FOR CULTURE AND THE ARTS"]
[null,"NATIONAL INTELLIGENCE COORDINATING AGENCY","A045",{"$nulls":9},"39101619-FL-C01",11,{"v":0,"d":"0.00"},null,"A045","NATIONAL INTELLIGENCE COORDINATING AGENCY"]
[null,"NATIONAL LIVELIHOOD SUPPORT FUND","A046",{"$nulls":9},"14111506-CF-L11",11,{"v":656,"d":"656.00"},null,"A046","NATIONAL LIVELIHOOD SUPPORT FUND"]
[null,"NATIONAL YOUTH COMMISSION","A047",{"$nulls":9},"14111506-CF-L12",11,{"v":990,"d":"990.00"},null,"A047","NATIONAL YOUTH COMMISSION"]
[null,"PRESIDENTIAL COMMUNICATIONS OPERATIONS OFFICE","A048",{"$nulls":9},"14111506-CF-L22",11,{"v":1250,"d":"1250.00"},null,"A048","PRESIDENTIAL COMMUNICATIONS OPERATIONS OFFICE"]
[null,"BUREAU OF BROADCAST SERVICES","A049",{"$nulls":9},"14111506-CF-L21",11,{"v":736,"d":"736.00"},null,"A049","BUREAU OF BROADCAST SERVICES"]
[null,"BUREAU OF COMMUNICATIONS SERVICES","A050",{"$nulls":9},"14111506-CF-L31",11,573.85,null,"A050","BUREAU OF COMMUNICATIONS SERVICES"]
[null,"BUREAU OF NATIONAL & FOREIGN INFORMATION, OPS","A051",{"$nulls":9},"14111506-CF-L32",11,{"v":995,"d":"995.00"},null,"A051","BUREAU OF NATIONAL & FOREIGN INFORMATION, OPS"]
[null,"NATIONAL MEDIA PRODUCTION CENTER, OPS","A052",{"$nulls":9},"14111506-CF-C31",11,{"v":477.6,"d":"477.60"},null,"A052","NATIONAL MEDIA PRODUCTION CENTER, OPS"]
[null,"NEWS AND INFORMATION BUREAU","A053",{"$nulls":9},"14111506-CF-C32",11,748.85,null,"A053","NEWS AND INFORMATION BUREAU"]
[null,"NATIONAL PRINTING OFFICE","A054",{"$nulls":9},"44121801-CT-R01",11,16.88,null,"A054","NATIONAL PRINTING OFFICE"]
[null,"PHILIPPINE INFORMATION AGENCY","A055",{"$nulls":9},"44121612-BL-H01",11,11.32,null,"A055","PHILIPPINE INFORMATION AGENCY"]
[null,"PRESIDENTIAL PRESS SECRETARY, OPS","A056",{"$nulls":9},"44121612-CU-H01",11,26.35,null,"A056","PRESIDENTIAL PRESS SECRETARY, OPS"]
[null,"PRESIDENTIAL MANAGEMENT STAFF","A057",{"$nulls":9},"44111515-DF-B01",11,{"v":67.1,"d":"67.10"},null,"A057","PRESIDENTIAL MANAGEMENT STAFF"]
[null,"PRESIDENTIAL ACTION CENTER, PMS","A058",{"$nulls":9},"44122011-DF-F01",11,{"v":66,"d":"66.00"},null,"A058","PRESIDENTIAL ACTION CENTER, PMS"]
[null,"PRESIDENTIAL SUPPORT FUND, PMS","A059",{"$nulls":9},"44103202-DS-M01",11,459.98,null,"A059","PRESIDENTIAL SUPPORT FUND, PMS"]
[null,"COMMITTEE ON PRIVATIZATION","A060",{"$nulls":9},"60101733-SC-F03",11,{"v":179,"d":"179.00"},null,"A060","COMMITTEE ON PRIVATIZATION"]
{"$rows_left_out":3985}
{"sheet":"APP","index":1,"n_rows":650,"n_cols":28,"rows_kept":650,"merged":[[0,0,0,26],[1,0,1,26],[2,0,2,26],[3,0,3,26],[4,0,4,26],[6,0,6,26],[7,0,7,26],[8,0,8,26],[9,0,9,26],[10,0,10,26],[11,0,11,26],[12,0,12,26],[13,0,13,26],[14,0,14,26],[15,0,15,26],[16,0,16,26],[17,0,17,26],[18,0,18,26],[19,0,19,26],[20,0,20,26],[21,0,21,26],[22,0,22,26],[23,0,23,26],[24,3,24,10],[24,14,24,16],[24,23,24,25],[25,3,25,7],[25,14,25,19],[25,23,25,25],[26,3,27,10],[26,23,26,25],[27,23,27,25],[29,0,30,2],[29,3,30,3],[29,4,29,23],[29,24,30,24],[29,25,30,25],[29,26,30,26],[31,0,31,26],[361,25,361,26],[386,0,386,26],[631,0,631,2],[631,24,631,26],[632,0,632,2],[632,24,632,26],[633,0,633,2],[633,24,633,26],[634,0,634,2],[634,24,634,26],[635,0,635,2],[635,24,635,26],[636,0,636,3],[636,4,638,6],[636,7,636,8],[636,9,638,11],[636,12,636,13],[636,14,638,16],[636,17,636,18],[636,19,638,21],[636,22,636,23],[636,24,636,26],[637,0,637,3],[637,7,637,8],[637,12,637,13],[637,17,637,18],[637,22,637,23],[637,24,637,26],[638,0,638,3],[638,7,638,8],[638,12,638,13],[638,17,638,18],[638,22,638,23],[638,24,638,26],[642,1,642,26],[646,2,646,5],[646,8,646,14],[646,17,646,24],[647,2,647,5],[647,8,647,14],[647,17,647,24]]}
[{"$nulls":27},"MAIN & NCR"]
["ANNUAL PROCUREMENT PLAN-COMMON SUPPLIES AND EQUIPMENT (APP-CSE) 2019 FORM",{"$nulls":26},1.04]
[]
["Introduction:"]
["Listed in this template are all the common supplies and equipment (CSE) carried in stock by the Procurement Service (PS) that may be purchased by government agencies. Agencies must accomplish this form and submit  in order to purchase CSEs from the PS.  Consistent with DBM Circular No. 2016-9 dated October 27, 2016 , the APP-CSE shall serve as the agency's APR for all its CSE requirements. Items in the template has been arranged in accordance with UNSPSC coding and this is in preparation for integration of the APP-CSE template in the Modernized Government Electronic Procurement System (MGEPS). "]
[]
["Instructions:"]
["1. Download the worksheet file APP-CSE 2019 template at www.ps-philgeps.gov.ph"]
["2. Indicate the agency’s monthly requirement per item in the APP-CSE 2019 form."]
["3. The agency should indicate zero if an item is not being purchased by the agency or purchased for a particular month."]
["4. Agency must not delete any item in the template; neither should it include line items or revise the template.  "]
["5. An APP-CSE is considered incorrect or invalid if"]
["a. form used is other than the prescribed format  which can be downloaded only at www.ps- philgeps.gov.ph  and;"]
["b. correct format is used but fields were deleted and/or inserted  in PART I of the template "]
["6. Fill out your CSE requirements that are available for purchase in the PS under the PART I.  For other Items that are not available from the PS but is regularly purchased by the agency from other sources, agency must indicate the items  in the PART II  and indicate likewise the unit prices based on its last purchase."]
["7. Once accomplished and finalized, the APP-CSE 2019 form should be:"]
["a. Saved using this format: APP2019_Name of Agency_Main or Regional Office (e.g. APP2019 _DBM_Central Office, APP2019 _DBM_Region IVA). "]
["b. Printed and signed by the agency Property/Supply Officer, Budget Officer and Head of the Procuring Entity.  An unsigned APP-CSE or that which lacks any of the three (3) signatures will be considered as an invalid submission."]
["8. The SIGNED COPY of the APP-CSE must be scanned and saved as pdf format.  Together with the excel file, the signed copy in pdf format should be submitted using the online facility at PS website . Ensure that two files are submitted."]
["9.  An agency may revise its APP-CSE during the year if there will be changes in its requirements.  However, it should submit an original APP-CSE within the prescribed deadline.  Agency may follow the same procedure as indicated in No. 7 when submitting the revised copy.All requirements in excess of the quantities indicated in the original APP-CSE will not be served if not covered by a revised APP-CSE."]
["10. For further assistance/clarification, agencies may call the Marketing and Sales Division of the Procurement Service at telephone nos. (02)561-6094 or (02)563-9352 and look for Ms. Evelyn I. Torres or Ms. Anna Liz C. Bona."]
[]
[]
["Note: Consistent with Memorandum Circular No. 2018-1 dated May 28, 2018 the APP-CSE for FY 2019 must be submitted on or before August 31, 2018."]
[null,null,"Department/Bureau/Office:","Department of Education - Division of Aklan ",{"$nulls":9},"Agency Account Code:","070010806001",{"$nulls":5},"Contact Person:",null,null,"Mildred B. Zante"]
[null,null,"Region:","VI - Western Visayas",{"$nulls":9},"Organization Type:",{"$nulls":6},"Position:",null,null,"Administrative Officer IV"]
[null,null,"Address:","Acrhbishop Reyes Street, poblacion, Kalibo, Aklan",{"$nulls":16},"E-mail : ",null,null,"mildredzante@deped.gov.ph"]
[null,null,"                ",{"$nulls":17},"Telephone/Mobile Nos: ",null,null,"(036) 268-3543"]
[]
["Item & Specifications",null,null,"Unit of Measure","Monthly Quantity Requirement",{"$nulls":19},"Total Quantity\nfor the year","Price Catalogue ","Total Amount\nfor the year"]
[{"$nulls":4},"Jan","Feb","Mar","Q1","Q1\nAMOUNT","April ","May ","June","Q2","Q2\nAMOUNT","July","Aug","Sept","Q3","Q3\nAMOUNT","Oct","Nov","Dec","Q4","Q4\nAMOUNT"]
["PART I. AVAILABLE AT PROCUREMENT SERVICE STORES"]
["Pesticides or Pest Repellents"]
[1,"10191509-IN-A01","INSECTICIDE, aerosol type, net content: 600ml min","can",{"$nulls":20},{"$f":"H34+M34+R34+W34","v":{"v":0,"d":"0.00"}},{"$f":"(VLOOKUP(B:B,AppLists!M:O,3,FALSE))*$AB$2","v":139.36},{"$f":"Y34*Z34","v":{"v":0,"d":"0.00"}}]
["Solvents"]
[2,"12191601-AL-E01","ALCOHOL, ethyl, 68%-70%, scented, 500ml (-5ml)","bottle",{"$nulls":20},{"$f":"H36+M36+R36+W36","v":{"v":0,"d":"0.00"}},{"$f":"(VLOOKUP(B:B,AppLists!M:O,3,FALSE))*$AB$2","v":{"v":43.992,"d":"43.99"}},{"$f":"Y36*Z36","v":{"v":0,"d":"0.00"}}]
["Color Compounds and Dispersions"]
[3,"12171703-SI-P01","STAMP PAD INK, purple or violet","bottle",{"$nulls":20},{"v":0,"d":"0.00"},{"$f":"(VLOOKUP(B:B,AppLists!M:O,3,FALSE))*$AB$2","v":{"v":24.627200000000002,"d":"24.63"}},{"v":0,"d":"0.00"}]
["Films"]
[4,"13111203-AC-F01","ACETATE, thickness: 0.075mm min (gauge #3)","roll",{"$nulls":20},{"$f":"H40+M40+R40+W40","v":{"v":0,"d":"0.00"}},{"$f":"(VLOOKUP(B:B,AppLists!M:O,3,FALSE))*$AB$2","v":{"v":737.2352000000001,"d":"737.24"}},{"$f":"Y40*Z40","v":{"v":0,"d":"0.00"}}]
[5,"13111201-CF-P02","CARBON FILM, PE, black, size 210mm x 297mm","box",{"$nulls":20},{"$f":"H41+M41+R41+W41","v":{"v":0,"d":"0.00"}},{"$f":"(VLOOKUP(B:B,AppLists!M:O,3,FALSE))*$AB$2","v":208.52},{"$f":"Y41*Z41","v":{"v":0,"d":"0.00"}}]
[6,"13111201-CF-P02","CARBON FILM, PE, black, size 216mm x 330mm","box",{"$nulls":20},{"$f":"H42+M42+R42+W42","v":{"v":0,"d":"0.00"}},{"$f":"(VLOOKUP(B:B,AppLists!M:O,3,FALSE))*$AB$2","v":208.52},{"$f":"Y42*Z42","v":{"v":0,"d":"0.00"}}]
["Paper Materials and Products"]
[7,"14111525-CA-A01","CARTOLINA, assorted colors","pack",{"$nulls":20},{"$f":"H44+M44+R44+W44","v":{"v":0,"d":"0.00"}},{"$f":"(VLOOKUP(B:B,AppLists!M:O,3,FALSE))*$AB$2","v":{"v":72.7792,"d":"72.78"}},{"$f":"Y44*Z44","v":{"v":0,"d":"0.00"}}]
[8,"14111506-CF-L11","CONTINUOUS FORM, 1 PLY, 280 x 241mm","box",{"$nulls":20},{"v":0,"d":"0.00"},{"$f":"(VLOOKUP(B:B,AppLists!M:O,3,FALSE))*$AB$2","v":682.24},{"v":0,"d":"0.00"}]
[9,"14111506-CF-L12","CONTINUOUS FORM, 1 PLY, 280 x 378mm","box",{"$nulls":20},{"v":0,"d":"0.00"},{"$f":"(VLOOKUP(B:B,AppLists!M:O,3,FALSE))*$AB$2","v":{"v":1029.6000000000001,"d":"1,029.60"}},{"v":0,"d":"0.00"}]
[10,"14111506-CF-L22","CONTINUOUS FORM, 2 ply, 280 x 378mm, carbonless","box",{"$nulls":20},{"v":0,"d":"0.00"},{"$f":"(VLOOKUP(B:B,AppLists!M:O,3,FALSE))*$AB$2","v":{"v":1300,"d":"1,300.00"}},{"v":0,"d":"0.00"}]
[11,"14111506-CF-L21","CONTINUOUS FORM, 2 ply, 280mm x 241mm, carbonless","box",{"$nulls":20},{"v":0,"d":"0.00"},{"$f":"(VLOOKUP(B:B,AppLists!M:O,3,FALSE))*$AB$2","v":765.44},{"v":0,"d":"0.00"}]
[12,"14111506-CF-L31","CONTINUOUS FORM, 3 PLY, 280 x 241mm, carbonless","box",{"$nulls":20},{"v":0,"d":"0.00"},{"$f":"(VLOOKUP(B:B,AppLists!M:O,3,FALSE))*$AB$2","v":{"v":596.8040000000001,"d":"596.80"}},{"v":0,"d":"0.00"}]
[13,"14111506-CF-L32","CONTINUOUS FORM, 3 PLY, 280 x 378mm, carbonless","box",{"$nulls":20},{"v":0,"d":"0.00"},{"$f":"(VLOOKUP(B:B,AppLists!M:O,3,FALSE))*$AB$2","v":{"v":1034.8,"d":"1,034.80"}},{"v":0,"d":"0.00"}]
[14,"14111609-LL-C01","LOOSELEAF COVER, made of chipboard, for legal","bundle",{"$nulls":20},{"v":0,"d":"0.00"},{"$f":"(VLOOKUP(B:B,AppLists!M:O,3,FALSE))*$AB$2","v":{"v":670.696,"d":"670.70"}},{"v":0,"d":"0.00"}]
[15,"14111514-NP-S02","NOTE PAD, stick on, 50mm x 76mm (2\" x 3\") min","pad",{"$nulls":20},{"v":0,"d":"0.00"},{"$f":"(VLOOKUP(B:B,AppLists!M:O,3,FALSE))*$AB$2","v":{"v":32.2192,"d":"32.22"}},{"v":0,"d":"0.00"}]
[16,"14111514-NP-S04","NOTE PAD, stick on, 76mm x 100mm (3\" x 4\") min","pad",{"$nulls":20},{"v":0,"d":"0.00"},{"$f":"(VLOOKUP(B:B,AppLists!M:O,3,FALSE))*$AB$2","v":{"v":56.056,"d":"56.06"}},{"v":0,"d":"0.00"}]
[17,"14111514-NP-S03","NOTE PAD, stick on, 76mm x 76mm (3\" x 3\") min","pad",{"$nulls":20},{"v":0,"d":"0.00"},{"$f":"(VLOOKUP(B:B,AppLists!M:O,3,FALSE))*$AB$2","v":{"v":41.496,"d":"41.50"}},{"v":0,"d":"0.00"}]
[18,"14111514-NB-S01","NOTEBOOK, STENOGRAPHER, spiral, 40 leaves","piece",{"$nulls":20},{"v":0,"d":"0.00"},{"$f":"(VLOOKUP(B:B,AppLists!M:O,3,FALSE))*$AB$2","v":{"v":12.0432,"d":"12.04"}},{"v":0,"d":"0.00"}]
[19,"14111507-PP-M01","PAPER, MULTICOPY, 80gsm, size: 210mm x 297mm","ream",{"$nulls":20},{"v":0,"d":"0.00"},{"$f":"(VLOOKUP(B:B,AppLists!M:O,3,FALSE))*$AB$2","v":{"v":132.37120000000002,"d":"132.37"}},{"v":0,"d":"0.00"}]
[20,"14111507-PP-M02","PAPER, MULTICOPY, 80gsm, size: 216mm x 330mm","ream",{"$nulls":20},{"v":0,"d":"0.00"},{"$f":"(VLOOKUP(B:B,AppLists!M:O,3,FALSE))*$AB$2","v":{"v":154.752,"d":"154.75"}},{"v":0,"d":"0.00"}]
[21,"14111507-PP-C01","PAPER, Multi-Purpose (COPY) A4, 70 gsm","ream",{"$nulls":20},{"v":0,"d":"0.00"},{"$f":"(VLOOKUP(B:B,AppLists!M:O,3,FALSE))*$AB$2","v":{"v":114.51440000000001,"d":"114.51"}},{"v":0,"d":"0.00"}]
[22,"14111507-PP-C02","PAPER, Multi-Purpose (COPY) Legal, 70 gsm","ream",{"$nulls":20},{"v":0,"d":"0.00"},{"$f":"(VLOOKUP(B:B,AppLists!M:O,3,FALSE))*$AB$2","v":{"v":129.97920000000002,"d":"129.98"}},{"v":0,"d":"0.00"}]
[23,"14111531-PP-R01","PAPER, PAD, ruled, size: 216mm x 330mm (± 2mm)","pad",{"$nulls":20},{"v":0,"d":"0.00"},{"$f":"(VLOOKUP(B:B,AppLists!M:O,3,FALSE))*$AB$2","v":{"v":17.3472,"d":"17.35"}},{"v":0,"d":"0.00"}]
{"$rows_left_out":591}
{"sheet":"db_header","index":2,"n_rows":1,"n_cols":7,"rows_kept":1}
["IQNum","IQDate","AgencyCode","ValidDate","Saddress","AgencyName","AgencyAddress"]

{"sheet":"db_details_Q1","index":3,"n_rows":1,"n_cols":5,"rows_kept":1}
["IQNum","ProdCode","Qty","Price","Segment"]

{"sheet":"db_details_Q2","index":4,"n_rows":1,"n_cols":5,"rows_kept":1}
["IQNum","ProdCode","Qty","Price","Segment"]

{"sheet":"db_details_Q3","index":5,"n_rows":1,"n_cols":5,"rows_kept":1}
["IQNum","ProdCode","Qty","Price","Segment"]

{"sheet":"db_details_Q4","index":6,"n_rows":1,"n_cols":5,"rows_kept":1}
["IQNum","ProdCode","Qty","Price","Segment"]